Gallium,tris(1,1,1,5,5,5-hexafluoro-2,4-pentanedionato-o,o')-

Gas phase ion energetics data

Data compiled as indicated in comments:
LLK - Sharon G. Lias, Rhoda D. Levin, and Sherif A. Kafafi
B - John E. Bartmess

Electron affinity determinations

EA (eV) Method Reference Comment
2.619 ± 0.022IMRESharpe, Eyler, et al., 1990EA given is actually -ΔGea(350 K); B

Ionization energy determinations

IE (eV) Method Reference Comment
10.19 ± 0.07PEEvans, Hamnett, et al., 1972Vertical value; LLK

Phase change data

Data compiled by: William E. Acree, Jr., James S. Chickos

Enthalpy of sublimation

ΔsubH (kJ/mol) Temperature (K) Method Reference
53.0333. - 363.TGAFahlman and Barron, 2000

References

Sharpe, Eyler, et al., 1990
Sharpe, P.; Eyler, J.R.; Richardson, D.E., Free Energies of Electron Attachment to Tris(acetylacetonate) and Tris(hexafluoroacetylacetonate) Transition-Metal Complexes in the Gas Phase: Experimental Results and Ligand Field Analysis, Inorg. Chem., 1990, 29, 15, 2779, https://doi.org/10.1021/ic00340a014 . [all data]

Evans, Hamnett, et al., 1972
Evans, S.; Hamnett, A.; Orchard, A.F.; Lloyd, D.R., Study of the metal-oxygen bond in simple tris-chelate complexes by He(I) photoelectron spectroscopy, Faraday Discuss. Chem. Soc., 1972, 54, 227. [all data]