Beryllium,bis(1,1,1,5,5,5-hexafluoro-2,4-pentanedionato-o,o')-
- Formula: C10H2BeF12O4
- Molecular weight: 423.1135
- CAS Registry Number: 19648-82-9

Phase change data

Data compiled by: William E. Acree, Jr., James S. Chickos
Enthalpy of sublimation
ΔsubH (kJ/mol) | Temperature (K) | Method | Reference | Comment |
---|---|---|---|---|
66.1 | 319. | BG | Grinberg, Lazarev, et al., 1987 | Based on data from 289. to 349. K. |

Gas phase ion energetics data

Data compiled by: Sharon G. Lias, Rhoda D. Levin, and Sherif A. Kafafi
Ionization energy determinations
IE (eV) | Method | Reference | Comment |
---|---|---|---|
10.39 ± 0.07 | PE | Evans, Hamnett, et al., 1972 | Vertical value |

References

Grinberg, Lazarev, et al., 1987
Grinberg, Ya.Kh.; Lazarev, V.B.; Petukhov, V.V.; Novikova, G.Ya.; Sharpataya, G.A.; Ozerova, Z.P.,
Dokl. Akad. Nauk SSSR, 1987, 297, 633. [all data]
Evans, Hamnett, et al., 1972
Evans, S.; Hamnett, A.; Orchard, A.F.; Lloyd, D.R.,
Study of the metal-oxygen bond in simple tris-chelate complexes by He(I) photoelectron spectroscopy,
Faraday Discuss. Chem. Soc., 1972, 54, 227. [all data]