Naphtho[2,1,8-uva]pentacene

Gas phase ion energetics data

Data compiled by: Sharon G. Lias, Rhoda D. Levin, and Sherif A. Kafafi

Ionization energy determinations

IE (eV) Method Reference
6.57PEClar and Schmidt, 1979

References

Clar and Schmidt, 1979
Clar, E.; Schmidt, W., Correlations between photoelectron and UV absorption spectra of polycyclic hydrocarbons. The pyrene series, Tetrahedron, 1979, 35, 1027. [all data]