2(3H)-Naphthalenone, 4,4a,5,6,7,8-hexahydro-4a,5-dimethyl-3-(1-methylethylidene)-, (4ar-cis)-

Normal alkane RI, polar column, temperature ramp

Data compiled by: NIST Mass Spectrometry Data Center, William E. Wallace, director

Column type Capillary
Active phase DB-Wax
Column length (m) 15.
Carrier gas Helium
Substrate
Column diameter (mm) 0.25
Phase thickness (μm) 0.25
Tstart (C) 40.
Tend (C) 260.
Heat rate (K/min) 4.
Initial hold (min)
Final hold (min) 5.
I 2404.
ReferenceMiyazawa, Kawauchi, et al., 2010
Comment MSDC-RI

References

Miyazawa, Kawauchi, et al., 2010
Miyazawa, M.; Kawauchi, Y.; Utsumi, Y.; Takahashi, T., Character impact odorants of wild edible plant - Cacalia hastata L. var. orientalis - used in Japanese traditional food, J. Oleo Sci., 2010, 59, 10, 527-533, https://doi.org/10.5650/jos.59.527 . [all data]