Rubidium propionate
- Formula: C3H5O2Rb
- Molecular weight: 158.5384
- IUPAC Standard InChIKey: REGAZBBSEPGAJC-UHFFFAOYSA-M
- CAS Registry Number: 19559-54-7
- Chemical structure:

Phase change data

Data compiled as indicated in comments:
TRC - Thermodynamics Research Center, NIST Boulder Laboratories, Chris Muzny director
DH - Eugene S. Domalski and Elizabeth D. Hearing
Quantity | Value | Units | Method | Reference | Comment |
---|---|---|---|---|---|
Tfus | 623.1 | K | N/A | Ferloni, Sanesi, et al., 1975 | Crystal phase 1 phase; Uncertainty assigned by TRC = 0.2 K; TRC |
Enthalpy of phase transition
ΔHtrs (kJ/mol) | Temperature (K) | Initial Phase | Final Phase | Reference | Comment |
---|---|---|---|---|---|
1.510 | 317. | crystaline, III | crystaline, II | Ferloni, Sanesi, et al., 1975, 2 | DH |
2.970 | 564.3 | crystaline, II | crystaline, I | Ferloni, Sanesi, et al., 1975, 2 | DH |
14.560 | 623.1 | crystaline, I | liquid | Ferloni, Sanesi, et al., 1975, 2 | DH |
Entropy of phase transition
ΔStrs (J/mol*K) | Temperature (K) | Initial Phase | Final Phase | Reference | Comment |
---|---|---|---|---|---|
4.8 | 317. | crystaline, III | crystaline, II | Ferloni, Sanesi, et al., 1975, 2 | DH |
5.3 | 564.3 | crystaline, II | crystaline, I | Ferloni, Sanesi, et al., 1975, 2 | DH |
23.4 | 623.1 | crystaline, I | liquid | Ferloni, Sanesi, et al., 1975, 2 | DH |

References

Ferloni, Sanesi, et al., 1975
Ferloni, P.; Sanesi, M.; Franzosini, P.,
Phase transitions in the alkali C1-n.C4 alkanoates,
Z. Naturforsch., A: Phys., Phys. Chem., Kosmophys., 1975, 30, 1447-57. [all data]
Ferloni, Sanesi, et al., 1975, 2
Ferloni, P.; Sanesi, M.; Franzosini, P.; C4 alkanoates, Phase transitions in the alkali C1-n.,
Z. Naturforsch. 30a, 1975, 1447-1454. [all data]