9,12,15-Octadecatrienoic acid

Normal alkane RI, non-polar column, temperature ramp

Data compiled by: NIST Mass Spectrometry Data Center, William E. Wallace, director

Column type CapillaryCapillary
Active phase DB-1DB-5
Column length (m) 50.30.
Carrier gas N2He
Substrate
Column diameter (mm) 0.250.25
Phase thickness (μm) 0.250.25
Tstart (C) 95.40.
Tend (C) 240.260.
Heat rate (K/min) 4.2.
Initial hold (min)  5.
Final hold (min)  20.
I 2117.2125.
ReferencePala-Paul J., Perez-Alonso M.J., et al., 2006Senatore, Landolfi, et al., 2006
Comment MSDC-RI MSDC-RI

Normal alkane RI, polar column, temperature ramp

Data compiled by: NIST Mass Spectrometry Data Center, William E. Wallace, director

Column type Capillary
Active phase NB-351
Column length (m) 25.
Carrier gas H2
Substrate
Column diameter (mm) 0.3
Phase thickness (μm) 0.5
Tstart (C) 70.
Tend (C) 250.
Heat rate (K/min) 5.
Initial hold (min) 2.
Final hold (min)
I 3554.
ReferenceOnocha, Ekundayo, et al., 1999
Comment MSDC-RI

References

Pala-Paul J., Perez-Alonso M.J., et al., 2006
Pala-Paul J.; Perez-Alonso M.J.; Velasco-Negueruela A.; Ballesteros M.T.; Sanz J., Essential oil composition of Sideritis hirsuta L. from Guadalajara Province, Spain, Flavour Fragr. J., 2006, 21, 3, 410-415, https://doi.org/10.1002/ffj.1727 . [all data]

Senatore, Landolfi, et al., 2006
Senatore, F.; Landolfi, S.; Celik, S.; Bruno, M., Volatile components of Centaurea calcitrapa L. and Centaurea sphaerocephala L. ssp. sphaerocephala, two Asteraceae growing wild in Sicily, Flavour Fragr. J., 2006, 21, 2, 282-285, https://doi.org/10.1002/ffj.1585 . [all data]