3-Hexanone, 4,4-dimethyl-

Phase change data

Data compiled as indicated in comments:
BS - Robert L. Brown and Stephen E. Stein
TRC - Thermodynamics Research Center, NIST Boulder Laboratories, Chris Muzny director

Quantity Value Units Method Reference Comment
Tboil424.2KN/AWeast and Grasselli, 1989BS
Tboil426.65KN/APomerantz, Mears, et al., 1949Uncertainty assigned by TRC = 1.5 K; TRC
Tboil424.KN/ANybergh, 1922Uncertainty assigned by TRC = 3. K; TRC
Tboil424.2KN/AWischnegradsky, 1875Uncertainty assigned by TRC = 3. K; TRC

In addition to the Thermodynamics Research Center (TRC) data available from this site, much more physical and chemical property data is available from the following TRC products:

References

Weast and Grasselli, 1989
CRC Handbook of Data on Organic Compounds, 2nd Editon, Weast,R.C and Grasselli, J.G., ed(s)., CRC Press, Inc., Boca Raton, FL, 1989, 1. [all data]

Pomerantz, Mears, et al., 1949
Pomerantz, P.; Mears, T.W.; Howard, F.L., Separation and Identification of the Major C1 to C10 Components of Triptene Residue, J. Res. Natl. Bur. Stand. (U. S.), 1949, 42, 617-32. [all data]

Nybergh, 1922
Nybergh, B., Chem. Ber., 1922, 55, 1960. [all data]

Wischnegradsky, 1875
Wischnegradsky, A., Justus Liebigs Ann. Chem., 1875, 178, 103. [all data]