4-Heptanol, 3,5-dimethyl-

Phase change data

Data compiled by: Thermodynamics Research Center, NIST Boulder Laboratories, Chris Muzny director

Quantity Value Units Method Reference Comment
Tboil452.15KN/AMaurel, Choque, et al., 1964Uncertainty assigned by TRC = 2. K
Tboil450.65KN/AConant, Webb, et al., 1929Uncertainty assigned by TRC = 4. K
Tboil450.65KN/AConant, Webb, et al., 1929Uncertainty assigned by TRC = 3. K
Tboil444.15KN/AVavon and Ivanoff, 1923Uncertainty assigned by TRC = 4. K

In addition to the Thermodynamics Research Center (TRC) data available from this site, much more physical and chemical property data is available from the following TRC products:

References

Maurel, Choque, et al., 1964
Maurel, R.; Choque, A.; Pecque, M., Preparation of diastereoisomeric Saturated Aliphatic Hydrocarbons, C. R. Hebd. Seances Acad. Sci., 1964, 259, 2650. [all data]

Conant, Webb, et al., 1929
Conant, J.B.; Webb, C.N.; Mendum, W.C., Trimethylacetaldehyde and dimethylethylacetaldehyde, J. Am. Chem. Soc., 1929, 51, 1246. [all data]

Vavon and Ivanoff, 1923
Vavon, G.; Ivanoff, D., C. R. Hebd. Seances Acad. Sci., 1923, 177, 453. [all data]