4a,8a-Ethenonaphthalene

Gas phase ion energetics data

Data compiled as indicated in comments:
LLK - Sharon G. Lias, Rhoda D. Levin, and Sherif A. Kafafi

Ionization energy determinations

IE (eV) Method Reference Comment
8.1PEGleiter, Heilbronner, et al., 1973Vertical value; LLK

References

Gleiter, Heilbronner, et al., 1973
Gleiter, R.; Heilbronner, E.; Paquette, L.A.; Thompson, G.L.; Wingard, R.E., Jr., Photoelectron spectra of polyunsaturated[4,4,2]propellanes, Tetrahedron, 1973, 29, 565. [all data]