4,5-Dimethyl-2-isopropyloxazole
- Formula: C8H13NO
- Molecular weight: 139.1949
- IUPAC Standard InChIKey: OHMVVHYBMWXHSY-UHFFFAOYSA-N
- CAS Registry Number: 19519-45-0
- Chemical structure:

Van Den Dool and Kratz RI, non-polar column, temperature ramp

Column type | Active phase | I | Reference | Comment |
---|---|---|---|---|
Capillary | SPD-1 | 938. | Carlin, Jin, et al., 1986 | 50. C @ 5. min, 2. K/min, 280. C @ 30. min; Column length: 60. m; Column diameter: 0.25 mm |

Van Den Dool and Kratz RI, polar column, custom temperature program

Column type | Active phase | I | Reference | Comment |
---|---|---|---|---|
Capillary | Carbowax 20M | 1261. | Baltes and Bochmann, 1987 | Column length: 50. m; Column diameter: 0.3 mm; Program: not specified |

Normal alkane RI, non-polar column, custom temperature program

Column type | Active phase | I | Reference | Comment |
---|---|---|---|---|
Capillary | SE-30 | 960. | Vinogradov, 2004 | Program: not specified |

Normal alkane RI, polar column, custom temperature program

Column type | Active phase | I | Reference | Comment |
---|---|---|---|---|
Capillary | Carbowax | 1260. | Baltes and Bochmann, 1987, 2 | Program: not specified |
Capillary | Carbowax | 1261. | Baltes and Bochmann, 1987, 2 | Program: not specified |

References

Carlin, Jin, et al., 1986
Carlin, J.T.; Jin, Q.Z.; Huang, T.-C.; Ho, C.-T.; Chang, S.S.,
Identification of alkyloxazoles, in the volatile compounds from french-fried potatoes,
J. Agric. Food Chem., 1986, 34, 4, 621-623, https://doi.org/10.1021/jf00070a008
. [all data]
Baltes and Bochmann, 1987
Baltes, W.; Bochmann, G.,
Model reactions on roast aroma formation. 1. Reaction of serine and threonine with sucrose under the conditions of coffee roasting and identification of new coffee aroma compounds,
J. Agric. Food Chem., 1987, 35, 3, 340-346, https://doi.org/10.1021/jf00075a015
. [all data]
Vinogradov, 2004
Vinogradov, B.A.,
Production, composition, properties and application of essential oils, 2004, retrieved from http://viness.narod.ru. [all data]
Baltes and Bochmann, 1987, 2
Baltes, W.; Bochmann, G.,
Model reactions on roast aroma formations, V. Mass spectrometric identification of pyrifines, oxazoles, and carbocyclic compounds from the reaction of serine and threonine with sucrose under the conditions of coffee roasting,
Z. Lebensm. Unters. Forsch., 1987, 185, 1, 5-9, https://doi.org/10.1007/BF01083331
. [all data]