Chromium anion

Gas phase ion energetics data

Data compiled by: John E. Bartmess

Protonation reactions

Cr- + Hydrogen cation = HCr

By formula: Cr- + H+ = HCr

Quantity Value Units Method Reference Comment
Δr1470. ± 16.kJ/molD-EABilodeau, Scheer, et al., 1998gas phase
Quantity Value Units Method Reference Comment
Δr1389. ± 13.kJ/molIMRBSallans, Lane, et al., 1985gas phase; May be from long-lived excited state

Gas phase thermochemistry data

Data compiled as indicated in comments:
B - John E. Bartmess

Quantity Value Units Method Reference Comment
Δfgas331.5 ± 2.1kJ/molR-EABilodeau, Scheer, et al., 1998B
Quantity Value Units Method Reference Comment
gas,1 bar173.03J/mol*KReviewChase, 1998Data last reviewed in March, 1984

References

Bilodeau, Scheer, et al., 1998
Bilodeau, R.C.; Scheer, M.; Haugen, H.K., Infrared Laser Photodetachment of Transition Metal Negative Ions: Studies on Cr-, Mo-, Cu-, and Ag-, J. Phys. B: Atom. Mol. Opt. Phys., 1998, 31, 17, 3885-3891, https://doi.org/10.1088/0953-4075/31/17/013 . [all data]

Sallans, Lane, et al., 1985
Sallans, L.; Lane, K.R.; Squires, R.R.; Freiser, B.S., Generation and reactions of atomic metal anions in the gas phase. Determination of the heterolytic and homolytic bond energies of VH, VrH, FeH, CoH, and MoH, J. Am. Chem. Soc., 1985, 107, 4379. [all data]