1-(4'-Nitrobenzylidene)-2-phenazinoylhydrazine

Phase change data

Data compiled by: William E. Acree, Jr., James S. Chickos

Enthalpy of fusion

ΔfusH (kJ/mol) Temperature (K) Method Reference
44.8548.2DSCCiocazanu, Meltzer, et al., 1997

References

Ciocazanu, Meltzer, et al., 1997
Ciocazanu, I.; Meltzer, V.; Nicolae, A.; Vilcu, R., Thermodynamic study of some substituted derivatives of 1-phenazinecarboxlic acid, Calorim. Anal. Therm., 1997, 28, 267. [all data]