2-Bromo-3,3,3-trifluoro-N,N-bis(trifluoromethyl)propylamine

Phase change data

Data compiled by: William E. Acree, Jr., James S. Chickos

Enthalpy of vaporization

ΔvapH (kJ/mol) Temperature (K) Method Reference Comment
34.2353.AStephenson and Malanowski, 1987Based on data from 342. - 365. K. See also Freear and Tipping, 1968.

References

Stephenson and Malanowski, 1987
Stephenson, Richard M.; Malanowski, Stanislaw, Handbook of the Thermodynamics of Organic Compounds, 1987, https://doi.org/10.1007/978-94-009-3173-2 . [all data]

Freear and Tipping, 1968
Freear, J.; Tipping, A.E., Fluorinated acetylenes. Part I. The preparation of NN-bistrifluoromethylethynylamines, J. Chem. Soc., C, 1968, 1096, https://doi.org/10.1039/j39680001096 . [all data]