Benzoic acid, 3-hydroxy-, methyl ester

Gas phase ion energetics data

Data evaluated as indicated in comments:
HL - Edward P. Hunter and Sharon G. Lias

Data compiled as indicated in comments:
B - John E. Bartmess

Quantity Value Units Method Reference Comment
Proton affinity (review)850.0kJ/molN/AHunter and Lias, 1998HL
Quantity Value Units Method Reference Comment
Gas basicity819.1kJ/molN/AHunter and Lias, 1998HL

De-protonation reactions

C8H7O3- + Hydrogen cation = Benzoic acid, 3-hydroxy-, methyl ester

By formula: C8H7O3- + H+ = C8H8O3

Quantity Value Units Method Reference Comment
Δr1438. ± 8.8kJ/molG+TSFujio, McIver, et al., 1981gas phase; B
Quantity Value Units Method Reference Comment
Δr1410. ± 8.4kJ/molIMREFujio, McIver, et al., 1981gas phase; B

Reaction thermochemistry data

Data compiled by: John E. Bartmess

Individual Reactions

C8H7O3- + Hydrogen cation = Benzoic acid, 3-hydroxy-, methyl ester

By formula: C8H7O3- + H+ = C8H8O3

Quantity Value Units Method Reference Comment
Δr1438. ± 8.8kJ/molG+TSFujio, McIver, et al., 1981gas phase
Quantity Value Units Method Reference Comment
Δr1410. ± 8.4kJ/molIMREFujio, McIver, et al., 1981gas phase

Phase change data

Data compiled by: Robert L. Brown and Stephen E. Stein

Reduced pressure boiling point

Tboil (K) Pressure (atm) Reference
553.20.933Weast and Grasselli, 1989

Kovats' RI, non-polar column, isothermal

View large format table.

Column type Active phase Temperature (C) I Reference Comment
PackedOV-1150.1389.Fedoreev and Maksimov, 1977Gaschrom; Column length: 1.5 m

Van Den Dool and Kratz RI, non-polar column, temperature ramp

View large format table.

Column type Active phase I Reference Comment
CapillaryBP-11415.Tan, Wilkins, et al., 1989H2, 40. C @ 2. min, 4. K/min, 240. C @ 75. min; Column length: 12. m

Normal alkane RI, non-polar column, temperature ramp

View large format table.

Column type Active phase I Reference Comment
CapillaryCP Sil 5 CB1384.Jayasekara, Stevenson, et al., 2002He, 60. C @ 2. min, 6. K/min; Column length: 25. m; Column diameter: 0.25 mm; Tend: 230. C
CapillaryHP-1011365.Milso, Mastelic, et al., 199825. m/0.2 mm/0.2 μm, He, 70. C @ 2. min, 3. K/min, 200. C @ 10. min

Normal alkane RI, non-polar column, custom temperature program

View large format table.

Column type Active phase I Reference Comment
CapillaryHP-11429.Rowland, Blackman, et al., 199525. m/0.25 mm/0.25 μm; Program: 30 0C (4 min) 6 K/min -> 200 0C 15 K/min -> 250 0C (20 min)

Normal alkane RI, polar column, temperature ramp

View large format table.

Column type Active phase I Reference Comment
CapillaryHP-20M2012.Milso, Mastelic, et al., 199850. m/0.2 mm/0.2 μm, He, 70. C @ 4. min, 4. K/min, 180. C @ 10. min

References

Hunter and Lias, 1998
Hunter, E.P.; Lias, S.G., Evaluated Gas Phase Basicities and Proton Affinities of Molecules: An Update, J. Phys. Chem. Ref. Data, 1998, 27, 3, 413-656, https://doi.org/10.1063/1.556018 . [all data]

Fujio, McIver, et al., 1981
Fujio, M.; McIver, R.T., Jr.; Taft, R.W., Effects on the acidities of phenols from specific substituent-solvent interactions. Inherent substituent parameters from gas phase acidities, J. Am. Chem. Soc., 1981, 103, 4017. [all data]