Curcumenol

Van Den Dool and Kratz RI, non-polar column, custom temperature program

View large format table.

Column type Active phase I Reference Comment
CapillaryHP-5MS1734.5Andriamaharavo, 201430. m/0.25 mm/0.25 μm, He; Program: 60C (1 min) => 5 C/min => 210C => 10 C/min => 280C (15 min)

Normal alkane RI, non-polar column, custom temperature program

View large format table.

Column type Active phase I Reference Comment
CapillarySE-301736.Vinogradov, 2004Program: not specified
CapillaryCP Sil 5 CB1719.Phan, Van, et al., 1998N2; Column length: 25. m; Program: not specified
CapillaryPolydimethyl siloxanes1716.Zenkevich, 1997Program: not specified

References

Andriamaharavo, 2014
Andriamaharavo, N.R., Retention Data. NIST Mass Spectrometry Data Center., NIST Mass Spectrometry Data Center, 2014. [all data]

Vinogradov, 2004
Vinogradov, B.A., Production, composition, properties and application of essential oils, 2004, retrieved from http://viness.narod.ru. [all data]

Phan, Van, et al., 1998
Phan, M.G.; Van, N.H.; Phan, T.S., Sesquiterpenoids fron the rhizomes of Curcuma aff. aeruginosa Roxb. of Vietnam, Tap chi Hoa hoc, 1998, 36, 3, 67-72. [all data]

Zenkevich, 1997
Zenkevich, I.G., Analytical Parameters of Components of Essential Oils for their Chromatographic and Chromato-Spectral Identificaiton. Oxsigenated derivatives of Mono- and Sesquiterpene Hydrocarbons, Rastit, Resursy (Rus.), 1997, 33, 1, 16-28. [all data]