Methane, chlorotrinitro-

Condensed phase thermochemistry data

Data compiled by: Hussein Y. Afeefy, Joel F. Liebman, and Stephen E. Stein

Quantity Value Units Method Reference Comment
Δfliquid-3.0kcal/molCcbPepekin and Korsunskii, 1995
Δfliquid-5.57 ± 0.18kcal/molCcrZimmer, Baroody, et al., 1964Heat of combustion of compound and benzoic acid =-866.883±0.18 Kcal/mol

References

Pepekin and Korsunskii, 1995
Pepekin, V.I.; Korsunskii, B.L., Thermochemistry of halopolynitroalkanes, Dokl. Phys. Chem. (Engl. Transl.), 1995, 340, 14-16, In original 342. [all data]

Zimmer, Baroody, et al., 1964
Zimmer, M.F.; Baroody, E.E.; Schwartz, M.; McAllister, M.P., Heat of formation of trinitrochloromethane by combustion calorimetry, J. Chem. Eng. Data, 1964, 9, 527-529. [all data]