2-Azapyrene

Lee's RI, non-polar column, temperature ramp

Data compiled by: NIST Mass Spectrometry Data Center, William E. Wallace, director

Column type CapillaryCapillary
Active phase SE-52SE-52
Column length (m) 12.20.
Carrier gas  H2
Substrate
Column diameter (mm) 0.250.30
Phase thickness (μm)  0.25
Tstart (C) 50.40.
Tend (C) 270.265.
Heat rate (K/min) 2.4.
Initial hold (min)  2.
Final hold (min)
I 362.20362.43
ReferenceHasegawa, Usami, et al., 1990Vassilaros, Kong, et al., 1982
Comment MSDC-RI MSDC-RI

References

Hasegawa, Usami, et al., 1990
Hasegawa, K.; Usami, S.; Higashide, A., Analysis of amino polycyclic aromatic hydrocarbons and polycyclic aromatic nitrogen heterocycles, Nippon Kagaku Kaishi, 1990, 7, 777-788, https://doi.org/10.1246/nikkashi.1990.777 . [all data]

Vassilaros, Kong, et al., 1982
Vassilaros, D.L.; Kong, R.C.; Later, D.W.; Lee, M.L., Linear retention index system for polycyclic aromatic compounds. Critical evaluation and additional indices, J. Chromatogr., 1982, 252, 1-20, https://doi.org/10.1016/S0021-9673(01)88394-1 . [all data]