9-Octadecenoic acid, methyl ester, (E)-

Phase change data

Data compiled as indicated in comments:
BS - Robert L. Brown and Stephen E. Stein
AC - William E. Acree, Jr., James S. Chickos

Reduced pressure boiling point

Tboil (K) Pressure (atm) Reference Comment
487.20.020Weast and Grasselli, 1989BS

Enthalpy of vaporization

ΔvapH (kcal/mol) Temperature (K) Method Reference Comment
18.5498.GCHusain, Sarma, et al., 1993Based on data from 453. - 543. K.; AC

References

Weast and Grasselli, 1989
CRC Handbook of Data on Organic Compounds, 2nd Editon, Weast,R.C and Grasselli, J.G., ed(s)., CRC Press, Inc., Boca Raton, FL, 1989, 1. [all data]

Husain, Sarma, et al., 1993
Husain, Sajid; Sarma, P. Nageswara; Swamy, G.Y.S.K.; Devi, K. Sita, Determination of physicochemical properties of some fatty acid methyl esters by gas liquid chromatography, J Am Oil Chem Soc, 1993, 70, 2, 149-155, https://doi.org/10.1007/BF02542618 . [all data]