2-Fluoro-2-methyl-1,3-diphenylpropane

Phase change data

Data compiled by: William E. Acree, Jr., James S. Chickos

Quantity Value Units Method Reference Comment
Δsub24.43 ± 0.26kcal/molN/ASchaffer, Verevkin, et al., 1997

Enthalpy of fusion

ΔfusH (kcal/mol) Temperature (K) Reference
7.10332.7Schaffer, Verevkin, et al., 1997

References

Schaffer, Verevkin, et al., 1997
Schaffer, F.; Verevkin, S.P.; Rieger, H.J.; Beckhaus, H.D.; Ruchardt, C., Enthalpies of formation of a series of fluorinated hydrocarbons and strain-free group increments to assess polar and anomeric stabilization and strain, Liebigs Ann., 1997, 1333-1344. [all data]