4-Octadecynoic acid

Phase change data

Data compiled by: William E. Acree, Jr., James S. Chickos

Enthalpy of fusion

ΔfusH (kcal/mol) Temperature (K) Method Reference
13.85348.TAJalal, Zografi, et al., 1982

References

Jalal, Zografi, et al., 1982
Jalal, I.M.; Zografi, G.; Rakshit, A.K.; Gunstone, F.D., Thermal analysis of fatty acids, Chemistry and Physics of Lipids, 1982, 31, 4, 395-404, https://doi.org/10.1016/0009-3084(82)90074-3 . [all data]