Silane,trimethyl(1-phenylethenyl)-

Gas phase ion energetics data

Data evaluated as indicated in comments:
HL - Edward P. Hunter and Sharon G. Lias

Data compiled as indicated in comments:
LLK - Sharon G. Lias, Rhoda D. Levin, and Sherif A. Kafafi

Quantity Value Units Method Reference Comment
Proton affinity (review)205.8kcal/molN/AHunter and Lias, 1998HL
Quantity Value Units Method Reference Comment
Gas basicity198.9kcal/molN/AHunter and Lias, 1998HL

Ionization energy determinations

IE (eV) Method Reference Comment
8.23 ± 0.04EIBenito, Seidl, et al., 1973LLK

References

Hunter and Lias, 1998
Hunter, E.P.; Lias, S.G., Evaluated Gas Phase Basicities and Proton Affinities of Molecules: An Update, J. Phys. Chem. Ref. Data, 1998, 27, 3, 413-656, https://doi.org/10.1063/1.556018 . [all data]

Benito, Seidl, et al., 1973
Benito, I.; Seidl, H.; Bock, H., Efectos electronicos y estericos de sustituyentes alquilicos y silicicos sobre el sistema electronico π del estireno, Rev. Fac. Cienc. Univ. Oviedo, 1973, 14, 95. [all data]