1,2,3-Trichloro-4,5,6-trimethylbenzene

Condensed phase thermochemistry data

Data compiled by: Eugene S. Domalski and Elizabeth D. Hearing

Quantity Value Units Method Reference Comment
solid,1 bar75.270cal/mol*KN/ALagarrigue, 1972

Constant pressure heat capacity of solid

Cp,solid (cal/mol*K) Temperature (K) Reference Comment
60.311298.15Lagarrigue, 1972T = 20 to 300 K.

Phase change data

Data compiled by: Thermodynamics Research Center, NIST Boulder Laboratories, Chris Muzny director

Quantity Value Units Method Reference Comment
Tfus498.KN/AWhite, Biggs, et al., 1940Uncertainty assigned by TRC = 2. K

In addition to the Thermodynamics Research Center (TRC) data available from this site, much more physical and chemical property data is available from the following TRC products:

References

Lagarrigue, 1972
Lagarrigue, M., Etude de la chaleur specifique des derives chlores de l'hexamethylbenzene entre 30 et 300 K. I. 1,2,3-trichloro-4,5,6-trimethylbenzene, Mol. Cryst. Liq. Cryst., 1972, 17, 237-249. [all data]

White, Biggs, et al., 1940
White, A.H.; Biggs, B.S.; Morgan, S.O., Dielectric Evidence for Molecular Rotation in the Crystals of Certain Benzene Derivatives, J. Am. Chem. Soc., 1940, 62, 16-25. [all data]