trans-β-Guaiene

Normal alkane RI, non-polar column, custom temperature program

Data compiled by: NIST Mass Spectrometry Data Center, William E. Wallace, director

Column type CapillaryCapillaryCapillaryCapillaryCapillary
Active phase DB-5CP Sil 8 CBCP Sil 8 CBDB-1DB-5
Column length (m) 50.30.50.30.30.
Carrier gas Helium HeliumHeHydrogen
Substrate
Column diameter (mm) 0.320.250.320.250.25
Phase thickness (μm) 0.250.250.250.10.25
Program 60 0C (2 min) 5 0C/min -> 160 0C (1 min) 10 0C/min -> 250 0C (3 min)60C => 2.5C/min => 170C => 10C/min => 250C (5min)not specified35C => 4C/min => 180C => 10C/min => 250C35 0C 4 0C/min -> 180 0C 17 0C/min -> 280 0C (10 min)
I 1502.1500.1513.1503.1503.
ReferenceJudzentiene and Budiene, 2008Kristiawan, Sobolik, et al., 2008Kupcinskiene, Stikliene, et al., 2008Albuquerque, Vasconcelos Silva, et al., 2007Santos, Santiago, et al., 2007
Comment MSDC-RI MSDC-RI MSDC-RI MSDC-RI MSDC-RI
Column type CapillaryCapillary
Active phase DB-5CP Sil 8 CB
Column length (m) 30.50.
Carrier gas HeHe
Substrate
Column diameter (mm) 0.250.32
Phase thickness (μm) 0.10.25
Program 35C => 4C/min => 180C => 20C/min => 280C60C(1min) => 5C/min => 160C => 10C/min => 250C(5min)
I 1500.1500.
ReferenceBarros-Filho, Nunes, et al., 2004Mockute, Nivinskiene, et al., 2003
Comment MSDC-RI MSDC-RI

References

Judzentiene and Budiene, 2008
Judzentiene, A.; Budiene, J., Volatile constituents from aerial parts and roots of Cichorium intybis L. (chicory) grown in Lithuania, Chemija, 2008, 19, 2, 25-28. [all data]

Kristiawan, Sobolik, et al., 2008
Kristiawan, M.; Sobolik, V.; Al-Haddad, M.; Allaf, K., Effect of pressure-drop rate on the isolation of cananga oil using instantaneous controlled pressure-drop process, Chem. Eng. Processing, 2008, 47, 1, 66-75, https://doi.org/10.1016/j.cep.2007.08.011 . [all data]

Kupcinskiene, Stikliene, et al., 2008
Kupcinskiene, E.; Stikliene, A.; Judzentiene, A., The essential oil guatitative composition in the needles of Pinus sylvestris L. growing along industrial transects, Environ. Pollution, 2008, 155, 3, 481-491, https://doi.org/10.1016/j.envpol.2008.02.001 . [all data]

Albuquerque, Vasconcelos Silva, et al., 2007
Albuquerque, R.L.; Vasconcelos Silva, M.G.; Machado, M.I.L.; Matos, F.J.A.; Morais, S.M.; Neto, J.S., Chemical composition and antioxidant activity of Plectranthus grandis and P. ornatus essential oils from north-eastern Brazil, Flavour Fragr. J., 2007, 22, 1, 24-26, https://doi.org/10.1002/ffj.1730 . [all data]

Santos, Santiago, et al., 2007
Santos, H.S.; Santiago, G.M.P.; de Oliveira, J.P.P.; Arriaga, A.M.C.; Marques, D.D.; Lemos, T.L.G., Chemical composition and larvicidal activity against Aedes aegypti of essential oils from Croton zehntneri, Natural Product Communications, 2007, 2, 12, 1233-1236. [all data]

Barros-Filho, Nunes, et al., 2004
Barros-Filho, B.A.; Nunes, F.M.; de Oliveira, M.C.F.; Mafezoli, J.; Andrade-Neto, M.; Silveira, E.R.; Pirani, J.R., Volatile constituents from Esenbeckia almawillia (Rutaceae), Biochem. Syst. Ecol., 2004, 32, 9, 817-821, https://doi.org/10.1016/j.bse.2004.02.003 . [all data]

Mockute, Nivinskiene, et al., 2003
Mockute, D.; Nivinskiene, O.; Bernotiene, G.; Butkiene, R., The cis-thujone chemotype of Salvia officinalis L. essential oils, Chemija, 2003, 14, 4, 216-220. [all data]