1-Hydroxy-2-(prop-2-enyl)-4,5-methylenedioxybenzene

Normal alkane RI, non-polar column, temperature ramp

View large format table.

Column type Active phase I Reference Comment
CapillaryDP-51547.Vijayakumar, Duraipandiyan, et al., 201230. m/0.25 mm/0.25 μm, Helium, 80. C @ 1. min, 4. K/min, 300. C @ 40. min
CapillaryDP-51547.Vijayakumar, Duraipandiyan, et al., 201230. m/0.25 mm/0.25 μm, Helium, 80. C @ 1. min, 4. K/min, 300. C @ 40. min

References

Vijayakumar, Duraipandiyan, et al., 2012
Vijayakumar, A.; Duraipandiyan, V.; Jeyarai, B.; Agastian, P.; Raj, M.K.; Ignacimunthu, S., Phytochemical analysis and in vitro antimicrobial activity of Illicium griffithii Hook f. Thoms extracts, Asian Pacific J. Tropical Diseases, 2012, 2, 3, 190-199, https://doi.org/10.1016/S2222-1808(12)60045-0 . [all data]