2-Cyano-6-nitro-1(2H)-quinolinecarboxylic acid, butyl ester

Phase change data

Data compiled by: William E. Acree, Jr., James S. Chickos

Enthalpy of fusion

ΔfusH (kcal/mol) Temperature (K) Method Reference
6.013359.1DSCLizarraga, Zabaleta, et al., 2005

References

Lizarraga, Zabaleta, et al., 2005
Lizarraga, Elena; Zabaleta, Camino; Palop, Juan A., Thermal decomposition and stability of quinoline compounds using thermogravimetry and differential scanning calorimetry, Thermochimica Acta, 2005, 427, 1-2, 171-174, https://doi.org/10.1016/j.tca.2004.09.008 . [all data]