Sodium anion

Gas phase thermochemistry data

Quantity Value Units Method Reference Comment
gas,1 bar147.95J/mol*KReviewChase, 1998Data last reviewed in December, 1983

Reaction thermochemistry data

Data compiled by: John E. Bartmess

Individual Reactions

Na- + Hydrogen cation = Sodium hydride

By formula: Na- + H+ = HNa

Quantity Value Units Method Reference Comment
Δr1444.0 ± 2.0kJ/molD-EAPatterson, Hotop, et al., 1974gas phase
Quantity Value Units Method Reference Comment
Δr1423.5 ± 2.4kJ/molH-TSPatterson, Hotop, et al., 1974gas phase

Gas phase ion energetics data

Data compiled by: John E. Bartmess

Protonation reactions

Na- + Hydrogen cation = Sodium hydride

By formula: Na- + H+ = HNa

Quantity Value Units Method Reference Comment
Δr1444.0 ± 2.0kJ/molD-EAPatterson, Hotop, et al., 1974gas phase
Quantity Value Units Method Reference Comment
Δr1423.5 ± 2.4kJ/molH-TSPatterson, Hotop, et al., 1974gas phase

References

Chase, 1998
Chase, M.W., Jr., NIST-JANAF Themochemical Tables, Fourth Edition, J. Phys. Chem. Ref. Data, Monograph 9, 1998, 1-1951. [all data]

Patterson, Hotop, et al., 1974
Patterson, T.A.; Hotop, H.; Kasdan, A.; Norcross, D.W.; Lineberger, W.C., Resonances in Alkali Negative-Ion Photodetachment and Electron Affinities of the Corresponding Neutrals, Phys. Rev. Lett., 1974, 32, 5, 189, https://doi.org/10.1103/PhysRevLett.32.189 . [all data]