Terephthalic bisamidrazone

Condensed phase thermochemistry data

Data compiled by: Eugene S. Domalski and Elizabeth D. Hearing

Quantity Value Units Method Reference Comment
solid,1 bar255.2J/mol*KN/AKaryakin, Sapozhnikov, et al., 1973

Constant pressure heat capacity of solid

Cp,solid (J/mol*K) Temperature (K) Reference Comment
276.8298.Karyakin, Sapozhnikov, et al., 1973T = 20 to 298 K.

References

Karyakin, Sapozhnikov, et al., 1973
Karyakin, N.V.; Sapozhnikov, V.N.; Kiparisova, E.G.; Rabinovich, I.B., Low temperature specific heat and thermodynamic properties of some polyamines, Tr. Khim. Khim. Tekhnol, 1973, (1), 65-66. [all data]