Au26

Gas phase ion energetics data

Data compiled by: John E. Bartmess

Electron affinity determinations

EA (eV) Method Reference Comment
1.17 ± 0.26CIDTHerlert and Schweikhard, 2012

References

Herlert and Schweikhard, 2012
Herlert, A.; Schweikhard, L., Electron binding energies from collisional activation of metal-cluster dianions, Appl. Phys. B, 2012, 107, 4, 1131-1143, https://doi.org/10.1007/s00340-011-4792-9 . [all data]