Naphtho[1,2,3,4-rst]pentaphene

Gas phase ion energetics data

Data compiled by: Sharon G. Lias, Rhoda D. Levin, and Sherif A. Kafafi

Ionization energy determinations

IE (eV) Method Reference
6.96PEClar and Schmidt, 1979
7.09 ± 0.04PEBoschi, Clar, et al., 1974

References

Clar and Schmidt, 1979
Clar, E.; Schmidt, W., Correlations between photoelectron and UV absorption spectra of polycyclic hydrocarbons. The pyrene series, Tetrahedron, 1979, 35, 1027. [all data]

Boschi, Clar, et al., 1974
Boschi, R.; Clar, E.; Schmidt, W., Photoelectron spectra of polynuclear aromatics. III. The effect of nonplanarity in sterically overcrowded aromatic hydrocarbons, J. Chem. Phys., 1974, 60, 4406. [all data]