1-((1S,3aR,4R,7S,7aS)-4-Hydroxy-7-isopropyl-4-methyloctahydro-1H-inden-1-yl)ethanone

Kovats' RI, non-polar column, temperature ramp

View large format table.

Column type Active phase I Reference Comment
CapillaryDB-51702.Marongiu, Piras, et al., 200330. m/0.25 mm/0.25 μm, He, 3. K/min, 240. C @ 30. min; Tstart: 60. C
CapillaryDB-51700.Marongiu, Piras, et al., 200330. m/0.25 mm/0.25 μm, He, 3. K/min, 240. C @ 30. min; Tstart: 60. C
CapillaryDB-51734.da Silva, Zoghbi, et al., 199930. m/0.25 mm/0.25 μm, He, 4. K/min; Tstart: 60. C; Tend: 240. C
CapillaryDB-51700.Senatore, Urrunaga Soria, et al., 199830. m/0.25 mm/0.25 μm, He, 40. C @ 5. min, 2. K/min, 250. C @ 20. min
CapillaryDB-51700.Senatore, 199830. m/0.25 mm/0.25 μm, He, 40. C @ 5. min, 2. K/min, 250. C @ 20. min
CapillaryDB-51731.Loayza, Abujder, et al., 199540. C @ 2. min, 2. K/min, 210. C @ 120. min; Column length: 30. m

Van Den Dool and Kratz RI, non-polar column, temperature ramp

View large format table.

Column type Active phase I Reference Comment
CapillaryHP-5MS1707.Pavlovic, Kovacevic, et al., 200630. m/0.25 mm/0.25 μm, He, 3. K/min; Tstart: 60. C; Tend: 280. C
CapillaryHP-11703.Nath, Sarma, et al., 200224. m/0.32 mm/0.17 μm, He, 60. C @ 2. min, 4. K/min, 250. C @ 20. min

Van Den Dool and Kratz RI, non-polar column, custom temperature program

View large format table.

Column type Active phase I Reference Comment
CapillaryHP-5MS1745.3Andriamaharavo, 201430. m/0.25 mm/0.25 μm, He; Program: 60C (1 min) => 5 C/min => 210C => 10 C/min => 280C (15 min)

Normal alkane RI, non-polar column, temperature ramp

View large format table.

Column type Active phase I Reference Comment
CapillaryHP-5 MS1737.Radulovic, Dordevic, et al., 201030. m/0.25 mm/0.25 μm, Helium, 5. K/min, 290. C @ 10. min; Tstart: 70. C
CapillaryDB-51705.Ouamba, Ouabonzi, et al., 200625. m/0.25 mm/0.15 μm, N2, 50. C @ 3. min, 4. K/min; Tend: 200. C
CapillaryHP-5MS1732.Sabulal, Dan, et al., 200630. m/0.32 mm/0.25 μm, He, 3. K/min; Tstart: 60. C; Tend: 243. C
CapillaryDB-51752.Kowalski, 200530. m/0.25 mm/0.25 μm, Helium, 35. C @ 2. min, 4. K/min; Tend: 280. C
CapillaryDB-5MS1703.Marongiu, Piras, et al., 200530. m/0.25 mm/0.25 μm, He, 60. C @ 30. min, 3. K/min; Tend: 280. C
CapillaryHP-5MS1740.Petrakis, Roussis, et al., 20053. K/min; Column length: 30. m; Column diameter: 0.2 mm; Tstart: 60. C; Tend: 280. C
CapillaryDB-51735.Tellez, Estell, et al., 199730. m/0.25 mm/0.25 μm, Helium, 3. K/min; Tstart: 60. C; Tend: 240. C

Normal alkane RI, non-polar column, custom temperature program

View large format table.

Column type Active phase I Reference Comment
CapillaryHP-5 MS1711.Payo, Colo, et al., 2011Program: not specified
CapillaryHP-5 MS1715.Payo, Colo, et al., 2011Program: not specified
CapillaryHP-5 MS1716.Payo, Colo, et al., 2011Program: not specified
CapillaryHP-5 MS1718.Payo, Colo, et al., 2011Program: not specified
CapillaryHP-5 MS1730.Payo, Colo, et al., 2011Program: not specified
CapillaryHP-5 MS1735.Payo, Colo, et al., 2011Program: not specified
CapillaryHP-5 MS1735.Payo, Colo, et al., 2011Program: not specified
CapillaryHP-5 MS1735.Payo, Colo, et al., 2011Program: not specified
Capillary 1695.El-Shazily, Hafez, et al., 2004Program: not specified
CapillaryOV-11696.El-Shazly and Hussein, 2004He; Column length: 15. m; Column diameter: 0.317 mm; Program: 50C(4min) => 4C/min => 90C => 10C/min => 300C(10min)
CapillaryCP Sil 5 CB1712.Weyerstahl, Marschall, et al., 1998N2; Column length: 25. m; Phase thickness: 0.39 μm; Program: not specified

Normal alkane RI, polar column, custom temperature program

View large format table.

Column type Active phase I Reference Comment
CapillaryDB-Wax2545.Weyerstahl, Marschall, et al., 1998N2; Column length: 60. m; Phase thickness: 0.25 μm; Program: not specified

References

Marongiu, Piras, et al., 2003
Marongiu, B.; Piras, A.; Pani, F.; Porcedda, S.; Ballero, M., Extraction, separation and isolation of essential oils from natural matrices by supercritical CO2, Flavour Fragr. J., 2003, 18, 6, 505-509, https://doi.org/10.1002/ffj.1258 . [all data]

da Silva, Zoghbi, et al., 1999
da Silva, M.H.L.; Zoghbi, M.G.B.; Andrade, E.H.A.; Maia, J.G.S., The essential oils of Peperomia pellucida Kunth and P. circinnata link var. circinnata, Flavour Fragr. J., 1999, 14, 5, 312-314, https://doi.org/10.1002/(SICI)1099-1026(199909/10)14:5<312::AID-FFJ835>3.0.CO;2-B . [all data]

Senatore, Urrunaga Soria, et al., 1998
Senatore, F.; Urrunaga Soria, E.; Urrunaga Soria, R.; Porta, G.D.; de Feo, V., Essential oil from two peruvian Satureja species, Flavour Fragr. J., 1998, 13, 1, 1-4, https://doi.org/10.1002/(SICI)1099-1026(199801/02)13:1<1::AID-FFJ672>3.0.CO;2-4 . [all data]

Senatore, 1998
Senatore, F., Volatile constituents of Minthostachys setosa (Briq.) Epl. (Lamiaceae) from Peru, Flavour Fragr. J., 1998, 13, 4, 263-265, https://doi.org/10.1002/(SICI)1099-1026(1998070)13:4<263::AID-FFJ738>3.0.CO;2-H . [all data]

Loayza, Abujder, et al., 1995
Loayza, I.; Abujder, D.; Aranda, R.; Jakupovic, J.; Collin, G.; Deslauriers, H.; Jean, F.-I., Essential oils of Baccharis salicifolia, B. latifolia and B. dracunculifolia, Phytochemistry, 1995, 38, 2, 381-389, https://doi.org/10.1016/0031-9422(94)00628-7 . [all data]

Pavlovic, Kovacevic, et al., 2006
Pavlovic, M.; Kovacevic, N.; Tzakou, O.; Couladis, M., Essential oil composition of Anthemis triumfetti (L.) DC., Flavour Fragr. J., 2006, 21, 2, 297-299, https://doi.org/10.1002/ffj.1592 . [all data]

Nath, Sarma, et al., 2002
Nath, S.C.; Sarma, K.K.; Vajezikova, I.; Leclercq, P.A., Comparison of volatile inflorescence oils and taxonomy of certain Cymbopogon taxa described as Cymbopogon flexuosus (Nees ex Steud.) Wats., Biochem. Syst. Ecol., 2002, 30, 2, 151-162, https://doi.org/10.1016/S0305-1978(01)00066-7 . [all data]

Andriamaharavo, 2014
Andriamaharavo, N.R., Retention Data. NIST Mass Spectrometry Data Center., NIST Mass Spectrometry Data Center, 2014. [all data]

Radulovic, Dordevic, et al., 2010
Radulovic, N.; Dordevic, N.; Markovic, M.; Palic, R., Volatile constituents of Glechoma Hirsuta Waldst. Kit. and G. Hederacea L. (Lamiaceae), Bull. Chem. Soc. Ethiop., 2010, 24, 1, 67-76, https://doi.org/10.4314/bcse.v24i1.52962 . [all data]

Ouamba, Ouabonzi, et al., 2006
Ouamba, J.-M.; Ouabonzi, A.; Ekouya, A.; Bessière, J.-M.; Menut, C.; Abena, A.A.; Banzouzi, J.-T., Volatile constituents of the essential oil leaf of Lantana salvifolia Jacq. (Verbenaceae), Flavour Fragr. J., 2006, 21, 1, 158-161, https://doi.org/10.1002/ffj.1553 . [all data]

Sabulal, Dan, et al., 2006
Sabulal, B.; Dan, M.; Pradeep, N.S.; Valsamma, R.K.; George, V., Composition and antimicrobial activity of essential oil from the fruits of Amomum cannicarpum, Acta Pharm. Sin., 2006, 56, 473-480. [all data]

Kowalski, 2005
Kowalski, R., Analysis of lipophylic fraction from leaves, inflorescences and rhizomes of Siphium perfoliatum L., Acta Soc. Botanicorum Poloniae, 2005, 74, 1, 5-10, https://doi.org/10.5586/asbp.2005.001 . [all data]

Marongiu, Piras, et al., 2005
Marongiu, B.; Piras, A.; Porcedda, S.; Scorciapino, A., Chemical composition of the essential oil and supercritical CO2 extract of Commiphora myrrha (Nees) Engl. and of Acorus calamus L., J. Agric. Food Chem., 2005, 53, 20, 7939-7943, https://doi.org/10.1021/jf051100x . [all data]

Petrakis, Roussis, et al., 2005
Petrakis, P.V.; Roussis, V.; Papadimitriou, D.; Vagias, C.; Tsitsimpikou, C., The effect of terpenoid extracts from 15 pine species on the feeding behavioural sequence of the late instars of the pine processionary caterpillar Thaumetopoea pityocampa, Behav. Processes, 2005, 69, 3, 303-322, https://doi.org/10.1016/j.beproc.2004.12.008 . [all data]

Tellez, Estell, et al., 1997
Tellez, M.R.; Estell, R.E.; Frederickson, E.L.; Havstad, K.M., Essntial oil of Flourensia cernua DC, J. Essent. Oil Res., 1997, 9, 6, 619-624, https://doi.org/10.1080/10412905.1997.9700799 . [all data]

Payo, Colo, et al., 2011
Payo, D.A.; Colo, J.; Calumpong, H.; de Clerck, O., Variability of non-polar secondary metabolites in the Red Alga Portieria, Mar Drugs, 2011, 9, 11, 2438-2468, https://doi.org/10.3390/md9112438 . [all data]

El-Shazily, Hafez, et al., 2004
El-Shazily, A.M.; Hafez, S.S.; Wink, M., Comparative study of the essential oils and extracts of Achillea fragrantissima (Forssk.) Sch. Bip. and Achillea santolina L. (Asteraceae) from Egypt, Pharmazie, 2004, 59, 226-230. [all data]

El-Shazly and Hussein, 2004
El-Shazly, A.M.; Hussein, K.T., Chemical analysis and biological activities of the essential oil of Teucrium leucocladum Boiss. (Lamiaceae), Biochem. Syst. Ecol., 2004, 32, 7, 665-674, https://doi.org/10.1016/j.bse.2003.12.009 . [all data]

Weyerstahl, Marschall, et al., 1998
Weyerstahl, P.; Marschall, H.; Thefeld, K.; Subba, G.C., Constituents of the essential oil from the rhizomes of Hedychium gardnerianum Roscoe, Flavour Fragr. J., 1998, 13, 6, 377-388, https://doi.org/10.1002/(SICI)1099-1026(199811/12)13:6<377::AID-FFJ755>3.0.CO;2-F . [all data]