hexane, 3,4-dichloro-, (R*,S*)-

Phase change data

Data compiled by: Thermodynamics Research Center, NIST Boulder Laboratories, Chris Muzny director

Quantity Value Units Method Reference Comment
Tboil434.6KN/AHoff, Greenlee, et al., 1951Uncertainty assigned by TRC = 0.5 K
Quantity Value Units Method Reference Comment
Tfus228.31KN/AHoff, Greenlee, et al., 1951Uncertainty assigned by TRC = 0.7 K
Tfus228.67KN/AHoff, Greenlee, et al., 1951Uncertainty assigned by TRC = 0.3 K

In addition to the Thermodynamics Research Center (TRC) data available from this site, much more physical and chemical property data is available from the following TRC products:

References

Hoff, Greenlee, et al., 1951
Hoff, M.C.; Greenlee, K.W.; Boord, C.E., The Quantitavitve Inversion of cis- and trans-Alkene Isomers: A New Synthesis of Normal cis-Alkenes, J. Am. Chem. Soc., 1951, 73, 3329-36. [all data]