tris(6,6,7,7,8,8,8-heptafluoro-2,2-dimethyloctane-3,5-dionato-O,O')lanthanum

Phase change data

Data compiled by: William E. Acree, Jr., James S. Chickos

Enthalpy of sublimation

ΔsubH (kJ/mol) Temperature (K) Method Reference
145.2 ± 2.9387. - 403.MESwain and Karraker, 1971

References

Swain and Karraker, 1971
Swain, H.A.; Karraker, D.G., Vapor pressure of some tris-(Heptafluorodimethyloctanediono) lanthanide(III) chelates, Journal of Inorganic and Nuclear Chemistry, 1971, 33, 9, 2851-2856, https://doi.org/10.1016/0022-1902(71)80046-5 . [all data]