Cholesteryl laurate

Phase change data

Data compiled by: Thermodynamics Research Center, NIST Boulder Laboratories, Chris Muzny director

Quantity Value Units Method Reference Comment
Tfus364.KN/ADavis, Porter, et al., 1970Uncertainty assigned by TRC = 0.5 K

In addition to the Thermodynamics Research Center (TRC) data available from this site, much more physical and chemical property data is available from the following TRC products:

References

Davis, Porter, et al., 1970
Davis, G.J.; Porter, R.S.; Barrall, E.M., Evaluation of Thermal Transitions in Some Cholesteryl Esters of Saturated Aliphatic Acids, Mol. Cryst. Liq. Cryst., 1970, 10, 1-2, 1, https://doi.org/10.1080/15421407008083482 . [all data]