Dinaphtho[8,1,2-abc:8',1',2'-jkl]coronene

Gas phase ion energetics data

Data compiled by: Sharon G. Lias, Rhoda D. Levin, and Sherif A. Kafafi

Ionization energy determinations

IE (eV) Method Reference
6.70 ± 0.04PEBoschi, Clar, et al., 1974

References

Boschi, Clar, et al., 1974
Boschi, R.; Clar, E.; Schmidt, W., Photoelectron spectra of polynuclear aromatics. III. The effect of nonplanarity in sterically overcrowded aromatic hydrocarbons, J. Chem. Phys., 1974, 60, 4406. [all data]