Erbium ethylsulfate nonahydrate

Condensed phase thermochemistry data

Data compiled by: Eugene S. Domalski and Elizabeth D. Hearing

Quantity Value Units Method Reference Comment
solid,1 bar881.24J/mol*KN/AGerstein, Penney, et al., 1962

Constant pressure heat capacity of solid

Cp,solid (J/mol*K) Temperature (K) Reference Comment
801.21298.15Gerstein, Penney, et al., 1962T = 12 to 300 K.

References

Gerstein, Penney, et al., 1962
Gerstein, B.C.; Penney, C.J.; Spedding, F.H., Thermal study of crystal field splittings in erbium ethylsulfate, J. Chem. Phys., 1962, 37(11), 2610-2615. [all data]