2,3-Dicyanobicyclo[2.2.2]octa-2,5-diene

Gas phase ion energetics data

Data compiled by: Sharon G. Lias, John E. Bartmess, Joel F. Liebman, John L. Holmes, Rhoda D. Levin, and W. Gary Mallard

Ionization energy determinations

IE (eV) Method Reference Comment
9.6PEKobayashi, Yoshida, et al., 1987
9.5PEKobayashi, Yoshida, et al., 1986
9.81PEKobayashi, Yoshida, et al., 1987Vertical value
9.81PEKobayashi, Yoshida, et al., 1986Vertical value

References

Kobayashi, Yoshida, et al., 1987
Kobayashi, T.; Yoshida, Z.; Asako, Y.; Miki, S.; Kato, S., Electronic structures of dicyanobicycloalkadienes, J. Am. Chem. Soc., 1987, 109, 5103. [all data]

Kobayashi, Yoshida, et al., 1986
Kobayashi, T.; Yoshida, Z.; Asako, Y.; Kiki, S.; ato, S., Avoided crossing between the ground and first excited 2A' cation states of dicyanobicycloalkadiene series revealed by photoelectron spectroscopy, Chem. Phys. Lett., 1986, 125, 586. [all data]