Thallium tetradecanoate

Condensed phase thermochemistry data

Data compiled by: Eugene S. Domalski and Elizabeth D. Hearing

Quantity Value Units Method Reference Comment
solid,1 bar473.84J/mol*KN/ANgeyi and Westrum, 1987

Constant pressure heat capacity of solid

Cp,solid (J/mol*K) Temperature (K) Reference Comment
438.25298.15Ngeyi and Westrum, 1987T = 10 to 460 K.

References

Ngeyi and Westrum, 1987
Ngeyi, S.P.; Westrum, E.F., Jr., Lopez de la Fuente, F.L., Cheda, T.A.R., and Fernandez-Martin, F., Thermodynamics of thallium alkonates. III. Heat capacity and thermodynamic functions of thallium(I) n-tetradecanoate from 7 to 450 K, J. Chem. Thermodynam., 1987, 19, 327-335. [all data]