1,3,6,10-Cyclotetradecatetraene, 3,7,11-trimethyl-14-(1-methylethyl)-, [S-(E,Z,E,E)]-

Van Den Dool and Kratz RI, non-polar column, temperature ramp

Data compiled by: NIST Mass Spectrometry Data Center, William E. Wallace, director

Column type CapillaryCapillaryCapillaryCapillaryCapillary
Active phase BP-1DB-5HP-5HP-5MSDB-1
Column length (m) 50.30.25.30.30.
Carrier gas HeN2HeHeN2
Substrate
Column diameter (mm) 0.220.320.250.250.32
Phase thickness (μm) 0.250.250.250.250.25
Tstart (C) 60.60.60.60.50.
Tend (C) 220.240.240.280.260.
Heat rate (K/min) 2.3.4.4.2.
Initial hold (min)  3. 5.3.
Final hold (min) 20.5.  5.
I 1932.1939.1930.1948.1924.
ReferenceDuquesnoy, Castola, et al., 2007Dob, Dahmane, et al., 2006Rezazadeh, Hamedani, et al., 2006Saroglou, Dorizas, et al., 2006Dob, Berramdane, et al., 2005
Comment MSDC-RI MSDC-RI MSDC-RI MSDC-RI MSDC-RI
Column type CapillaryCapillary
Active phase DB-5MSHP-5MS
Column length (m) 30.30.
Carrier gas HeHe
Substrate
Column diameter (mm) 0.250.25
Phase thickness (μm) 0.250.25
Tstart (C) 40.60.
Tend (C) 200.280.
Heat rate (K/min) 4.4.
Initial hold (min) 5.5.
Final hold (min) 20.
I 1923.1941.
ReferenceYu, Kim, et al., 2004Skaltsa, Mavrommati, et al., 2001
Comment MSDC-RI MSDC-RI

Normal alkane RI, polar column, temperature ramp

Data compiled by: NIST Mass Spectrometry Data Center, William E. Wallace, director

Column type Capillary
Active phase TC-FFAP
Column length (m)
Carrier gas He
Substrate
Column diameter (mm) 0.25
Phase thickness (μm) 0.25
Tstart (C) 60.
Tend (C) 220.
Heat rate (K/min) 3.
Initial hold (min)
Final hold (min) 30.
I 2175.
ReferenceKurose, Okamura, et al., 2007
Comment MSDC-RI

References

Duquesnoy, Castola, et al., 2007
Duquesnoy, E.; Castola, V.; Casanova, J., Composition and chemical variability of the twig oil of Abies alba Miller from Corsica, Flavour Fragr. J., 2007, 22, 4, 293-299, https://doi.org/10.1002/ffj.1796 . [all data]

Dob, Dahmane, et al., 2006
Dob, T.; Dahmane, D.; Chelghoum, C., Essential oil composition of Juniperus oxycedrus growing in Algeria, Pharm. Biol., 2006, 44, 1, 1-6, https://doi.org/10.1080/13880200500530922 . [all data]

Rezazadeh, Hamedani, et al., 2006
Rezazadeh, S.; Hamedani, M.P.; Dowlatabadi, R.; Yazdani, D.; Shafiee, A., Chemical composition of the essential oils of Stachys schtschegleevii Sosn. and Stachys balansae Boiss Kotschy from Iran, Flavour Fragr. J., 2006, 21, 2, 290-293, https://doi.org/10.1002/ffj.1587 . [all data]

Saroglou, Dorizas, et al., 2006
Saroglou, V.; Dorizas, N.; Kypriotakis, Z.; Skaltsa, H.D., Analysis of the essential oil composition of eight Anthemis species from Greece, J. Chromatogr. A, 2006, 1104, 1-2, 313-322, https://doi.org/10.1016/j.chroma.2005.11.087 . [all data]

Dob, Berramdane, et al., 2005
Dob, T.; Berramdane, T.; Dahmane, D.; Chelghoum, C., Chemical composition of the needles oil of Pinus canariensis from Algeria, Chem. Nat. Compd. (Engl. Transl.), 2005, 41, 2, 165-167, https://doi.org/10.1007/s10600-005-0103-1 . [all data]

Yu, Kim, et al., 2004
Yu, E.J.; Kim, T.H.; Kim, K.H.; Lee, H.J., Aroma-active compounds of Pinus densiflora (red pine) needles, Flavour Fragr. J., 2004, 19, 6, 532-537, https://doi.org/10.1002/ffj.1337 . [all data]

Skaltsa, Mavrommati, et al., 2001
Skaltsa, H.D.; Mavrommati, A.; Constantinidis, T., A chemotaxonomic investigation of volatile constituents in Stachys subsect. Swainsonianeae (Labiatae), Phytochemistry, 2001, 57, 2, 235-244, https://doi.org/10.1016/S0031-9422(01)00003-6 . [all data]