1,2-dibromo-2,2,2-trifluoroethane

Phase change data

Data compiled by: Thermodynamics Research Center, NIST Boulder Laboratories, Chris Muzny director

Quantity Value Units Method Reference Comment
Tboil346.KN/ADavis and Larsen, 1967Uncertainty assigned by TRC = 3. K

In addition to the Thermodynamics Research Center (TRC) data available from this site, much more physical and chemical property data is available from the following TRC products:

References

Davis and Larsen, 1967
Davis, R.A.; Larsen, E.R., Chemistry of Boron Trifluoride. The Fluorination of Bromofluoroethanes, J. Org. Chem., 1967, 32, 3478. [all data]