δ-Amorphene

Normal alkane RI, non-polar column, custom temperature program

Data compiled by: NIST Mass Spectrometry Data Center, William E. Wallace, director

Column type CapillaryCapillaryCapillaryCapillaryCapillary
Active phase CB-1CB-1HP-5Polydimethyl siloxaneCP Sil 8 CB
Column length (m) 30.30.30. 50.
Carrier gas HeliumHeliumHelium He
Substrate
Column diameter (mm) 0.250.250.25 0.32
Phase thickness (μm) 0.250.250.25 0.25
Program 40 0C (2 min) 4 0C/min -> 180 0C 20 0C/min -> 220 0C (1 min)not specified40 0C (3 min) 3 0C/min -> 160 0C (2 min) 8 0C/min -> 220 0C (3 min)not specified60C(2min) => 5C/min => 160C(1min) => 10C/min => 250C (5min)
I 1505.1499.1525.1506.1512.
ReferenceKannaste, Vongvanich, et al., 2008Kannaste, Vongvanich, et al., 2008Qiao, Xie, et al., 2008Werka, Boehme, et al., 2007Judzentiene and Buzelyte, 2006
Comment MSDC-RI MSDC-RI MSDC-RI MSDC-RI MSDC-RI
Column type CapillaryCapillaryCapillary
Active phase SE-52DB-5CP Sil 5 CB
Column length (m) 30.30.25.
Carrier gas HeHe
Substrate
Column diameter (mm) 0.320.25
Phase thickness (μm) 0.150.25
Program 45C => 1C/min => 100C => 5C/min => 250C (10min)35C => 4C/min => 180C => 10C/min => 250Cnot specified
I 1512.1509.1497.
ReferenceTognolini, Barocelli, et al., 2006Cysne, Canuto, et al., 2005Weyerstahl, Marschall, et al., 2000
Comment MSDC-RI MSDC-RI MSDC-RI

Van Den Dool and Kratz RI, non-polar column, temperature ramp

Data compiled by: NIST Mass Spectrometry Data Center, William E. Wallace, director

Column type CapillaryCapillaryCapillaryCapillary
Active phase HP-5DB-1DB-5CP Sil 5 CB
Column length (m) 30.30.30.30.
Carrier gas HeN2HeN2
Substrate
Column diameter (mm) 0.250.250.260.25
Phase thickness (μm)  0.250.250.25
Tstart (C) 60.50.60.50.
Tend (C) 260.200.246.200.
Heat rate (K/min) 3.5.3.5.
Initial hold (min)
Final hold (min)
I 1512.1505.1512.1519.
ReferenceJavidnia, Miri, et al., 2005Tchoumbougnang, Zollo, et al., 2005Adams, Habte, et al., 2004Martinez, Rosa, et al., 2004
Comment MSDC-RI MSDC-RI MSDC-RI MSDC-RI

Van Den Dool and Kratz RI, polar column, temperature ramp

Data compiled by: NIST Mass Spectrometry Data Center, William E. Wallace, director

Column type Capillary
Active phase Supelcowax-10
Column length (m) 30.
Carrier gas N2
Substrate
Column diameter (mm) 0.25
Phase thickness (μm) 0.25
Tstart (C) 50.
Tend (C) 200.
Heat rate (K/min) 5.
Initial hold (min)
Final hold (min)
I 1710.
ReferenceMartinez, Rosa, et al., 2004
Comment MSDC-RI

Normal alkane RI, polar column, custom temperature program

Data compiled by: NIST Mass Spectrometry Data Center, William E. Wallace, director

Column type Capillary
Active phase DB-Wax
Column length (m) 60.
Carrier gas N2
Substrate
Column diameter (mm)
Phase thickness (μm) 0.25
Program not specified
I 1726.
ReferenceWeyerstahl, Marschall, et al., 2000
Comment MSDC-RI

References

Kannaste, Vongvanich, et al., 2008
Kannaste, A.; Vongvanich, N.; Borg-Karlson, A.-K., Infestation by a Nalepella species induces emissions of alpha- and beta-farnesenes, (-)-linalool and aromatic compounds in Norway spruce clones of different susceptibility to the large pine weevil, Anthropod-Plant Interactions, 2008, 2, 1, 31-41, https://doi.org/10.1007/s11829-008-9029-4 . [all data]

Qiao, Xie, et al., 2008
Qiao, Y.; Xie, B.J.; Zhang, Y.; Zhang, Y.; FAn, G.; Yao, X.L.; Pan, S.Y., Characterization of aroma active compounds in fruit juice and peel oil of Junchen sweet orange fruit (Citrus sinensis (L.) Osbeck) by GC-MS and GC-O, Molecules, 2008, 13, 6, 1333-1344, https://doi.org/10.3390/molecules13061333 . [all data]

Werka, Boehme, et al., 2007
Werka, J.S.; Boehme, A.K.; Setzer, W.N., Biological activities of essential oils from Monteverde, Costa Rica, Natural Product Communications, 2007, 2, 12, 1215-1219. [all data]

Judzentiene and Buzelyte, 2006
Judzentiene, A.; Buzelyte, J., Chemical composition of essential oils of Artemisia vulgaris L. (mugwort) from North Lithuania, Chemija, 2006, 17, 1, 12-15. [all data]

Tognolini, Barocelli, et al., 2006
Tognolini, M.; Barocelli, E.; Ballabeni, V.; Bruni, R.; Bianchi, A.; Chiavarini, M.; Impicciatore, M., Comparative screening of plant essential oils: Phenylpropanoid moiety as basic core for antiplatelet activity, Life Sciences, 2006, 78, 13, 1419-1432, https://doi.org/10.1016/j.lfs.2005.07.020 . [all data]

Cysne, Canuto, et al., 2005
Cysne, J.B.; Canuto, K.M.; Pessoa, O.D.L.; Nunes, E.P.; Silveira, E.R., Leaf essential oils of four Piper species from the State of Ceará - Northeast of Brazil, J. Braz. Chem. Soc., 2005, 16, 6B, 1378-1381, https://doi.org/10.1590/S0103-50532005000800012 . [all data]

Weyerstahl, Marschall, et al., 2000
Weyerstahl, P.; Marschall, H.; Splittgerber, U.; Wolf, D.; Surburg, H., Constituents of Haitian vetiver oil, Flavour Fragr. J., 2000, 15, 6, 395-412, https://doi.org/10.1002/1099-1026(200011/12)15:6<395::AID-FFJ930>3.0.CO;2-9 . [all data]