tris(1,1,1,5,5,5-hexafluoro-2,4-pentanedionato)yttrium(III)
- Formula: C15H3F18O6Y
- Molecular weight: 710.0578
- CAS Registry Number: 18911-76-7

Phase change data

Data compiled by: William E. Acree, Jr., James S. Chickos
Enthalpy of sublimation
ΔsubH (kJ/mol) | Temperature (K) | Method | Reference |
---|---|---|---|
91.6 ± 8.5 | 310. to 365. | ME | Alikhanyan, Malkerova, et al., 1999 |

References

Alikhanyan, Malkerova, et al., 1999
Alikhanyan, A.S.; Malkerova, I.P.; Kuz'mina, N.P.; Gleizes, A.; Julve-Olsina, M.; Sanz, J.L.; Eremenko, I.L.,
Thermodynamic characteristics of a heteronuclear complex based on [N,N-ethylenebis(salicylaldiminato)]nickel(II), Ni(Salen), and yttrium tris-hexafluoroacetylacetonate Y(HFA)3,
Zh. Neorg. Khim., 1999, 44, 6, 969. [all data]