Cyclopenta(cd)perylene

Lee's RI, non-polar column, custom temperature program

Data compiled by: NIST Mass Spectrometry Data Center, William E. Wallace, director

Column type Capillary
Active phase DB-5MS
Column length (m) 60.
Carrier gas
Substrate
Column diameter (mm) 0.25
Phase thickness (μm)
Program not specified
I 484.7
ReferenceAracil, Font, et al., 2005
Comment MSDC-RI

References

Aracil, Font, et al., 2005
Aracil, I.; Font, R.; Conesa, J.A., Semivolatile and volatile compounds from the pyrolysis and combustion of polyvinyl chloride, J. Anal. Appl. Pyrolysis, 2005, 74, 1-2, 465-478, https://doi.org/10.1016/j.jaap.2004.09.008 . [all data]