Dialuminum hexabromide

Gas phase thermochemistry data

Quantity Value Units Method Reference Comment
Δfgas-937.22kJ/molReviewChase, 1998Data last reviewed in September, 1979
Quantity Value Units Method Reference Comment
gas,1 bar547.18J/mol*KReviewChase, 1998Data last reviewed in September, 1979

Gas Phase Heat Capacity (Shomate Equation)

Cp° = A + B*t + C*t2 + D*t3 + E/t2
H° − H°298.15= A*t + B*t2/2 + C*t3/3 + D*t4/4 − E/t + F − H
S° = A*ln(t) + B*t + C*t2/2 + D*t3/3 − E/(2*t2) + G
    Cp = heat capacity (J/mol*K)
    H° = standard enthalpy (kJ/mol)
    S° = standard entropy (J/mol*K)
    t = temperature (K) / 1000.

View plot Requires a JavaScript / HTML 5 canvas capable browser.

View table.

Temperature (K) 298. - 6000.
A 181.7580
B 0.989826
C -0.268276
D 0.022896
E -1.308024
F -995.8380
G 759.4922
H -937.2160
ReferenceChase, 1998
Comment Data last reviewed in September, 1979

Gas phase ion energetics data

Data compiled as indicated in comments:
LLK - Sharon G. Lias, Rhoda D. Levin, and Sherif A. Kafafi
RDSH - Henry M. Rosenstock, Keith Draxl, Bruce W. Steiner, and John T. Herron

Ionization energy determinations

IE (eV) Method Reference Comment
10.97PELappert, Pedley, et al., 1976Vertical value; LLK
10.97PELappert, Pedley, et al., 1974Vertical value; LLK

Appearance energy determinations

Ion AE (eV) Other Products MethodReferenceComment
Al2Br5+12.3 ± 0.5BrEIPorter and Zeller, 1960RDSH

References

Chase, 1998
Chase, M.W., Jr., NIST-JANAF Themochemical Tables, Fourth Edition, J. Phys. Chem. Ref. Data, Monograph 9, 1998, 1-1951. [all data]