Benzene, 1,1'-(1,1,2,2-tetramethyl-1,2-ethanediyl)bis-

Gas phase thermochemistry data

Data compiled by: Hussein Y. Afeefy, Joel F. Liebman, and Stephen E. Stein

Quantity Value Units Method Reference Comment
Δfgas57. ± 3.kJ/molCcbKratt, Beckhaus, et al., 1983ΔHfusion=6.1±0.1 kcal/mol, see Beckhaus, 1983

Condensed phase thermochemistry data

Data compiled as indicated in comments:
ALS - Hussein Y. Afeefy, Joel F. Liebman, and Stephen E. Stein
DH - Eugene S. Domalski and Elizabeth D. Hearing

Quantity Value Units Method Reference Comment
Δfsolid-39.3 ± 3.0kJ/molCcbKratt, Beckhaus, et al., 1983ΔHfusion=6.1±0.1 kcal/mol, see Beckhaus, 1983; ALS
Quantity Value Units Method Reference Comment
Δcsolid-10188.0 ± 3.0kJ/molCcbKratt, Beckhaus, et al., 1983ΔHfusion=6.1±0.1 kcal/mol, see Beckhaus, 1983; Corresponding Δfsolid = -39.3 kJ/mol (simple calculation by NIST; no Washburn corrections); ALS

Constant pressure heat capacity of solid

Cp,solid (J/mol*K) Temperature (K) Reference Comment
321.1298.Kratt, Beckhaus, et al., 1983, 2Cp given as 0.322 cal/g*K.; DH

Phase change data

Data compiled as indicated in comments:
TRC - Thermodynamics Research Center, NIST Boulder Laboratories, Chris Muzny director
ALS - Hussein Y. Afeefy, Joel F. Liebman, and Stephen E. Stein
DRB - Donald R. Burgess, Jr.
AC - William E. Acree, Jr., James S. Chickos

Quantity Value Units Method Reference Comment
Tfus392.KN/AKratt, Beckhaus, et al., 1983, 2Uncertainty assigned by TRC = 1. K; TRC
Tfus393.KN/ADannley and Zaremsky, 1955Uncertainty assigned by TRC = 4. K; TRC
Quantity Value Units Method Reference Comment
Δsub96.7 ± 0.8kJ/molVKratt, Beckhaus, et al., 1983ΔHfusion=6.1±0.1 kcal/mol, see Beckhaus, 1983; ALS
Δsub96.3kJ/molN/AKratt, Beckhaus, et al., 1983DRB

Enthalpy of sublimation

ΔsubH (kJ/mol) Temperature (K) Reference Comment
96.7 ± 0.8320.Kratt, Beckhaus, et al., 1983, 2Based on data from 293. - 348. K.; AC

Enthalpy of fusion

ΔfusH (kJ/mol) Temperature (K) Method Reference Comment
25.52392.DSCKratt, Beckhaus, et al., 1983, 2AC

In addition to the Thermodynamics Research Center (TRC) data available from this site, much more physical and chemical property data is available from the following TRC products:

References

Kratt, Beckhaus, et al., 1983
Kratt, G.; Beckhaus, H.D.; Bernlohr, W.; Ruchardt, C., Thermolabile kohlenwasserstoffe. XVII. Verbrennungsenthalpie und bildungsenthalpie von zehn sym.-tetraalkyl-1,2-diarylethanen, Thermochim. Acta, 1983, 62, 279-194. [all data]

Beckhaus, 1983
Beckhaus, H.D., Application of force field calculations. IV. Force field for the calculation of the structures and heats of formation of alkylbenzenes and its test of reliability on highly strained diphenylethanes, Chem. Ber., 1983, 116, 86-96. [all data]

Kratt, Beckhaus, et al., 1983, 2
Kratt, G.; Beckhaus, H.D.; Bernioehr, W.; Ruechardt, C., Thermolabile hydrocarbons. XVII. Enthalpies of combustion and formation of ten sym-tetraalkyl-1,2-diarylethanes, Thermochim. Acta, 1983, 62, 279-294. [all data]

Dannley and Zaremsky, 1955
Dannley, R.L.; Zaremsky, B., Free Radical Aromatic Substitution V. The Reaction of Benzoyl Peroxide with Alkylbenzenes, J. Am. Chem. Soc., 1955, 77, 1588. [all data]