Boron anion

Gas phase thermochemistry data

Data compiled as indicated in comments:
B - John E. Bartmess

Quantity Value Units Method Reference Comment
Δfgas128.6 ± 2.7kcal/molAcidScheer, Bilodeau, et al., 1998tunable IR laser; B
Quantity Value Units Method Reference Comment
gas,1 bar37.478cal/mol*KReviewChase, 1998Data last reviewed in June, 1983

Reaction thermochemistry data

Data compiled by: John E. Bartmess

Individual Reactions

B- + Hydrogen cation = Borane(1)

By formula: B- + H+ = HB

Quantity Value Units Method Reference Comment
Δr387.7 ± 2.1kcal/molD-EAScheer, Bilodeau, et al., 1998gas phase; tunable IR laser
Quantity Value Units Method Reference Comment
Δr381.0 ± 2.2kcal/molH-TSScheer, Bilodeau, et al., 1998gas phase; tunable IR laser

Gas phase ion energetics data

Data compiled by: John E. Bartmess

Protonation reactions

B- + Hydrogen cation = Borane(1)

By formula: B- + H+ = HB

Quantity Value Units Method Reference Comment
Δr387.7 ± 2.1kcal/molD-EAScheer, Bilodeau, et al., 1998gas phase; tunable IR laser
Quantity Value Units Method Reference Comment
Δr381.0 ± 2.2kcal/molH-TSScheer, Bilodeau, et al., 1998gas phase; tunable IR laser

References

Scheer, Bilodeau, et al., 1998
Scheer, M.; Bilodeau, R.C.; Haugen, H.K., Negative ion of boron: An experimental study of the P-3 ground state, Phys. Rev. Lett., 1998, 80, 12, 2562-2565, https://doi.org/10.1103/PhysRevLett.80.2562 . [all data]

Chase, 1998
Chase, M.W., Jr., NIST-JANAF Themochemical Tables, Fourth Edition, J. Phys. Chem. Ref. Data, Monograph 9, 1998, 1-1951. [all data]