tetrakis(2,2,6,6-tetramethylheptan-3,5-dionato)thorium(IV)

Phase change data

Data compiled by: William E. Acree, Jr., James S. Chickos

Enthalpy of sublimation

ΔsubH (kcal/mol) Temperature (K) Method Reference Comment
36.40 ± 0.79400.MESwain and Karraker, 1970Based on data from 391. - 409. K.

References

Swain and Karraker, 1970
Swain, Howard A.; Karraker, David G., Volatile chelates of quadrivalent actinides, Inorg. Chem., 1970, 9, 7, 1766-1769, https://doi.org/10.1021/ic50089a032 . [all data]