Diphenyl formazan

Condensed phase thermochemistry data

Data compiled by: Hussein Y. Afeefy, Joel F. Liebman, and Stephen E. Stein

Quantity Value Units Method Reference Comment
Δfsolid109.44 ± 0.91kcal/molCcbMcEwan and Rigg, 1951Reanalyzed by Pedley, Naylor, et al., 1986, Original value = 109.34 kcal/mol
Quantity Value Units Method Reference Comment
Δcsolid-1741.92 ± 0.25kcal/molCcbMcEwan and Rigg, 1951

References

McEwan and Rigg, 1951
McEwan, W.S.; Rigg, M.W., The heats of combustion of compounds containing the tetrazole ring, J. Am. Chem. Soc., 1951, 73, 4725-4727. [all data]

Pedley, Naylor, et al., 1986
Pedley, J.B.; Naylor, R.D.; Kirby, S.P., Thermochemical Data of Organic Compounds, Chapman and Hall, New York, 1986, 1-792. [all data]