Furan, 2-[[(1-methylethyl)thio]methyl]-

Kovats' RI, non-polar column, isothermal

View large format table.

Column type Active phase Temperature (C) I Reference Comment
CapillaryOV-101120.1113.Misharina, Aerov, et al., 1988Column length: 50. m; Column diameter: 0.32 mm
CapillaryOV-101130.1116.Misharina, Aerov, et al., 1988Column length: 50. m; Column diameter: 0.32 mm
CapillaryOV-101140.1119.Misharina, Aerov, et al., 1988Column length: 50. m; Column diameter: 0.32 mm

Van Den Dool and Kratz RI, non-polar column, temperature ramp

View large format table.

Column type Active phase I Reference Comment
CapillaryOV-1011106.Misharina, Aerov, et al., 19884. K/min; Column length: 50. m; Column diameter: 0.32 mm; Tstart: 50. C; Tend: 250. C
CapillaryOV-1011110.Misharina, Aerov, et al., 19888. K/min; Column length: 50. m; Column diameter: 0.32 mm; Tstart: 50. C; Tend: 250. C
CapillaryOV-1011105.Misharina, Aerov, et al., 19882. K/min; Column length: 50. m; Column diameter: 0.32 mm; Tstart: 80. C; Tend: 250. C

References

Misharina, Aerov, et al., 1988
Misharina, T.A.; Aerov, A.F.; Golovnya, R.V.; Stepanova, O.V.; Vysotskaya, L.E.; Gren, A.I., Retention indices of alkylfurfurylsulfides in isothermal and temperature-programmed capillary chromatography, Zh. Anal. Khim., 1988, 43, 8, 1489-1493. [all data]