1-Hexacosene

Normal alkane RI, non-polar column, temperature ramp

Data compiled by: NIST Mass Spectrometry Data Center, William E. Wallace, director

Column type CapillaryCapillary
Active phase HP-5 MSCP Sil 8 CB
Column length (m) 30.25.
Carrier gas HeliumH2
Substrate
Column diameter (mm) 0.250.20
Phase thickness (μm) 0.250.13
Tstart (C) 70.60.
Tend (C) 290.300.
Heat rate (K/min) 5.6.
Initial hold (min)
Final hold (min) 10.
I 2596.2593.
ReferenceRadulovic, Blagojevic, et al., 2010Yruela, Barbe, et al., 1990
Comment MSDC-RI MSDC-RI

Phase change data

Data compiled by: William E. Acree, Jr., James S. Chickos

Enthalpy of vaporization

ΔvapH (kJ/mol) Temperature (K) Reference Comment
106.1449.Dykyj, Svoboda, et al., 1999Based on data from 434. - 684. K.

References

Radulovic, Blagojevic, et al., 2010
Radulovic, N.; Blagojevic, P.; Palic, R., Comparative study of the leaf volatiles of Arctostaphylos uva-ursi (L.) Spreng. and Vaccinium vitis-idaea L. (Ericaceae), Molecules, 2010, 15, 9, 6168-6185, https://doi.org/10.3390/molecules15096168 . [all data]

Yruela, Barbe, et al., 1990
Yruela, I.; Barbe, A.; Grimalt, J.O., Determination of Double Bond Position and Geometry in Linear and High Branched Hydrocarbons and Fatty Acids from Gas Chromatography-Mass Spectrometry of Epoxides and Diols Generated by Stereospecific Resin Hydration, J. Chromatogr. Sci., 1990, 28, 8, 421-427, https://doi.org/10.1093/chromsci/28.8.421 . [all data]