Dichloro(trifluoromethylthio) phosphine

Phase change data

Data compiled by: William E. Acree, Jr., James S. Chickos

Enthalpy of vaporization

ΔvapH (kJ/mol) Temperature (K) Method Reference Comment
31.7308.AStephenson and Malanowski, 1987Based on data from 293. - 363. K. See also Dykyj, Svoboda, et al., 1999 and Emel«65533»us and Pugh, 1960.

References

Stephenson and Malanowski, 1987
Stephenson, Richard M.; Malanowski, Stanislaw, Handbook of the Thermodynamics of Organic Compounds, 1987, https://doi.org/10.1007/978-94-009-3173-2 . [all data]

Dykyj, Svoboda, et al., 1999
Dykyj, J.; Svoboda, J.; Wilhoit, R.C.; Frenkel, M.L.; Hall, K.R., Vapor Pressure of Chemicals: Part A. Vapor Pressure and Antoine Constants for Hydrocarbons and Sulfur, Selenium, Tellurium and Hydrogen Containing Organic Compounds, Springer, Berlin, 1999, 373. [all data]

Emel«65533»us and Pugh, 1960
Emel«65533»us, H.J.; Pugh, H., 228. Reactions of bistrifluoromethylthiomercury and trifluoromethylthiomercuric chloride, J. Chem. Soc., 1960, 1108, https://doi.org/10.1039/jr9600001108 . [all data]